Jump to content

[debian] pb install fglrx...


Recommended Posts

voici ou j'en suis :

 alien fglrx(...).deb
cd /lib/modules/fglrx/build_mod/
chmod +x ./make.sh
./make.sh

et la voici ce qu'il me renvoit :

/lib/modules/fglrx/build_mod/2.6.x/firegl_public.c:3018: error: `drm_agp_t' undeclared (first

use in this function)

/lib/modules/fglrx/build_mod/2.6.x/firegl_public.c:3018: error: (Each undeclared identifier i

s reported only once

/lib/modules/fglrx/build_mod/2.6.x/firegl_public.c:3018: error: for each function it appears

in.)

/lib/modules/fglrx/build_mod/2.6.x/firegl_public.c:3018: error: erreur d'analyse syntaxique b

efore ')' token

/lib/modules/fglrx/build_mod/2.6.x/firegl_public.c:3039: error: request for member `free_memo

ry' in something not a structure or union

/lib/modules/fglrx/build_mod/2.6.x/firegl_public.c:3041: error: request for member `free_memo

ry' in something not a structure or union

/lib/modules/fglrx/build_mod/2.6.x/firegl_public.c:3044: error: request for member `allocate_

memory' in something not a structure or union

/lib/modules/fglrx/build_mod/2.6.x/firegl_public.c:3046: error: request for member `allocate_

memory' in something not a structure or union

/lib/modules/fglrx/build_mod/2.6.x/firegl_public.c:3049: error: request for member `bind_memo

ry' in something not a structure or union

/lib/modules/fglrx/build_mod/2.6.x/firegl_public.c:3051: error: request for member `bind_memo

ry' in something not a structure or union

/lib/modules/fglrx/build_mod/2.6.x/firegl_public.c:3054: error: request for member `unbind_me

mory' in something not a structure or union

/lib/modules/fglrx/build_mod/2.6.x/firegl_public.c:3056: error: request for member `unbind_me

mory' in something not a structure or union

/lib/modules/fglrx/build_mod/2.6.x/firegl_public.c:3059: error: request for member `enable' i

n something not a structure or union

/lib/modules/fglrx/build_mod/2.6.x/firegl_public.c:3061: error: request for member `enable' i

n something not a structure or union

/lib/modules/fglrx/build_mod/2.6.x/firegl_public.c:3064: error: request for member `acquire'

in something not a structure or union

/lib/modules/fglrx/build_mod/2.6.x/firegl_public.c:3066: error: request for member `acquire'

in something not a structure or union

/lib/modules/fglrx/build_mod/2.6.x/firegl_public.c:3069: error: request for member `release'

in something not a structure or union

/lib/modules/fglrx/build_mod/2.6.x/firegl_public.c:3071: error: request for member `release'

in something not a structure or union

/lib/modules/fglrx/build_mod/2.6.x/firegl_public.c:3074: error: request for member `copy_info

' in something not a structure or union

/lib/modules/fglrx/build_mod/2.6.x/firegl_public.c:3076: error: request for member `copy_info

' in something not a structure or union

/lib/modules/fglrx/build_mod/2.6.x/firegl_public.c: Dans la fonction « __ke_agp_uninit »:

/lib/modules/fglrx/build_mod/2.6.x/firegl_public.c:3147: attention : `inter_module_put' is de

precated (declared at include/linux/module.h:578)

/lib/modules/fglrx/build_mod/2.6.x/firegl_public.c: Dans la fonction « __ke_agp_free_memory »

:

/lib/modules/fglrx/build_mod/2.6.x/firegl_public.c:3180: error: request for member `free_memo

ry' in something not a structure or union

/lib/modules/fglrx/build_mod/2.6.x/firegl_public.c:3181: error: request for member `free_memo

ry' in something not a structure or union

/lib/modules/fglrx/build_mod/2.6.x/firegl_public.c: Dans la fonction « __ke_agp_allocate_memo

ry »:

/lib/modules/fglrx/build_mod/2.6.x/firegl_public.c:3190: error: request for member `allocate_

memory' in something not a structure or union

/lib/modules/fglrx/build_mod/2.6.x/firegl_public.c:3191: error: request for member `allocate_

memory' in something not a structure or union

/lib/modules/fglrx/build_mod/2.6.x/firegl_public.c: Dans la fonction « __ke_agp_bind_memory »

:

/lib/modules/fglrx/build_mod/2.6.x/firegl_public.c:3201: error: request for member `bind_memo

ry' in something not a structure or union

/lib/modules/fglrx/build_mod/2.6.x/firegl_public.c:3202: error: request for member `bind_memo

ry' in something not a structure or union

/lib/modules/fglrx/build_mod/2.6.x/firegl_public.c: Dans la fonction « __ke_agp_unbind_memory

»:

/lib/modules/fglrx/build_mod/2.6.x/firegl_public.c:3212: error: request for member `unbind_me

mory' in something not a structure or union

/lib/modules/fglrx/build_mod/2.6.x/firegl_public.c:3213: error: request for member `unbind_me

mory' in something not a structure or union

/lib/modules/fglrx/build_mod/2.6.x/firegl_public.c: Dans la fonction « __ke_agp_enable »:

/lib/modules/fglrx/build_mod/2.6.x/firegl_public.c:3223: error: request for member `enable' i

n something not a structure or union

/lib/modules/fglrx/build_mod/2.6.x/firegl_public.c:3225: error: request for member `enable' i

n something not a structure or union

/lib/modules/fglrx/build_mod/2.6.x/firegl_public.c: Dans la fonction « __ke_agp_acquire »:

/lib/modules/fglrx/build_mod/2.6.x/firegl_public.c:3271: error: request for member `acquire'

in something not a structure or union

/lib/modules/fglrx/build_mod/2.6.x/firegl_public.c:3272: error: request for member `acquire'

in something not a structure or union

/lib/modules/fglrx/build_mod/2.6.x/firegl_public.c: Dans la fonction « __ke_agp_release »:

/lib/modules/fglrx/build_mod/2.6.x/firegl_public.c:3282: error: request for member `release'

in something not a structure or union

/lib/modules/fglrx/build_mod/2.6.x/firegl_public.c:3283: error: request for member `release'

in something not a structure or union

/lib/modules/fglrx/build_mod/2.6.x/firegl_public.c: Dans la fonction « __ke_agp_copy_info »:

/lib/modules/fglrx/build_mod/2.6.x/firegl_public.c:3296: error: request for member `copy_info

' in something not a structure or union

/lib/modules/fglrx/build_mod/2.6.x/firegl_public.c:3303: error: request for member `copy_info

' in something not a structure or union

make[2]: *** [/lib/modules/fglrx/build_mod/2.6.x/firegl_public.o] Erreur 1

make[1]: *** [_module_/lib/modules/fglrx/build_mod/2.6.x] Erreur 2

make[1]: Leaving directory `/usr/src/linux-2.6.11'

make: *** [kmod_build] Erreur 2

build failed with return value 2

je vous ais mis que les message a partir du message d'erreur :cartonrouge:

Link to comment
Share on other sites

ce qui m'epate c'est que g dl les drivers radeon alors pourquoi il me met du firegl_public dans tous les sens :cartonrouge:

alors

1) pas de posts multiples, il suffit d'éditer le premier

2) plus d'infos, là on a du mal à savoir d'où ça vient (et non " voici ou j'en suis", ça ne suffit pas, mais alors pas du tout)

Bon, revenons à ce qui est en quote:

quel rapport?

Link to comment
Share on other sites

alors

1) pas de posts multiples, il suffit d'éditer le premier

le #1 post etant de taille respectable j'ai pas osé le ralonger :cartonrouge:

2) plus d'infos, là on a du mal à savoir d'où ça vient (et non " voici ou j'en suis", ça ne suffit pas, mais alors pas du tout)

je vois pas ce que tu peux vouloir de plus ; j'ai expliquer les manips effectuer... je vais relire les liens important :chinois:

Bon, revenons à ce qui est en quote:

quel rapport?

ce qui est en quote est la partie du fichier log generé par le make ; j'ai d'ailleurs seulement gardé la partie avec les messages d'erreur

Link to comment
Share on other sites

hiya

oh yeah ---

bon jeux

moi - englaise ...

same problem --- same problemo -

uuuummmmm -- moi comp "das kaput"

anyway im trying some things ill get back to you - vous.

au revoir - mon ami

---edit - padawan - f-that - JEDI KNIGHT HERE YO

_________________________________________

alright ---- lookin good.

just did my thing - still have errors - but Voila- different errors.

i think it may be fixed - i just need to do the whole config thing ....

the config thing....-

get kernel source

configure

install - new kernel , modules.

then

drink some wine

then

he he

install fglrx package again ...

for me

i had a lean install - totally fresh - and i left out a few compiler packages...

im a slacker

get my stuff here

http://gulus.usherbrooke.ca/pub/distro/slackware/

i needed

autoconf-2.59-noarch-1.tgz gettext-tools-0.14.1-i486-2.tgz

automake-1.9.4-noarch-1.tgz guile-1.6.5-i486-1.tgz

bin86-0.16.15-i486-1.tgz indent-2.2.9-i386-1.tgz

binutils-2.15.92.0.2-i486-2.tgz libtool-1.5.10-i486-1.tgz

bison-1.35-i386-1.tgz m4-1.4.2-i486-1.tgz

byacc-1.9-i386-1.tgz make-3.80-i386-1.tgz

ccache-2.4-i486-1.tgz nasm-0.98.38-i486-1.tgz

clisp-2.33.2-i486-1.tgz oprofile-0.8.1-i486-2.tgz

cscope-15.5-i486-2.tgz p2c-1.21alpha2-i386-1.tgz

cvs-1.11.18-i486-1.tgz pkgconfig-0.15.0-i486-1.tgz

distcc-2.18.3-i486-1.tgz pmake-2.1.35-i386-2.tgz

doxygen-1.4.0-i486-1.tgz python-2.4-i486-1.tgz

flex-2.5.4a-i486-2.tgz rcs-5.7-i386-1.tgz

gdb-6.3-i486-1.tgz strace-4.5.4-i486-1.tgz

( left out gcc perl and ? becase i run the newer stuff )

from

http://gulus.usherbrooke.ca/pub/distro/sla....1/slackware/d/

added ( reinstalled )

anyway --- looks like i'm fixed - maybe - but yeah - check your compiler . redo - and do it ALL

Link to comment
Share on other sites

merci

je - fglx ENGAGED !

i just just super desperate and - loaded up 2.4.29 (latest)

bash-2.05b# ./make.sh

ATI module generator V 2.0

==========================

initializing...

cleaning...

patching 'highmem.h'...

probing for VMA API version...

doing script based build for kernel 2.4.x and similar

compiling './agpgart_be.c'...

compiling './agp3.c'...

compiling './i7505-agp.c'...

compiling './nvidia-agp.c'...

compiling './firegl_public.c'...

./firegl_public.c:208:1: warning: "pte_unmap" redefined

./firegl_public.c:141:1: warning: this is the location of the previous definition

linking of fglrx kernel module...

duplicating results into driver repository...

done.

==============================

You must change your working directory to /lib/modules/fglrx

and then call ./make_install.sh in order to install the built module.

==============================

ooh la la

and thanks for the patch - i may get back to that - the funny thing is - i'm POSITIVE

( i smoke alot of dope - so maybe no so positive )- i had it running a couple days ago - oh well what ever- i'm fixed. - till i break it again ...

--edit-- i get 814+ fgl_glxgears

radeon 9800 pro volt-mod- really nice card - get one.

and - i just checked - that patch is for the xorg version - that version pukes on my system

( yes- i once had THAT running too, but hey - oh well...? linux is fun )

__________________________________

bash-2.05b# patch -p2 < p1.patch

missing header for unified diff at line 8 of patch

can't find file to patch at input line 8

Perhaps you used the wrong -p or --strip option?

The text leading up to this was:

--------------------------

|

|

|2005-03-02 22:32 diff -lu or.c agpgart_be.c Page 1

|

|

|--- or.c 2005-01-31 19:50:00.000000000 +0200

|+++ agpgart_be.c 2005-03-02 22:19:25.000000000 +0200

--------------------------

File to patch: agpgart_be.c

patching file agpgart_be.c

Hunk #1 succeeded at 267 (offset 6 lines).

Hunk #2 FAILED at 4087.

Hunk #3 succeeded at 5309 (offset 13 lines).

Hunk #4 succeeded at 7458 with fuzz 2 (offset 11 lines).

1 out of 4 hunks FAILED -- saving rejects to file agpgart_be.c.rej

bash-2.05b#

____________compiles against 2.4 - good i guess... didn't break anything.--off to try

_________

i tried the second link further down - and applied properly - says it works - tres bien

warnings at

-agpgart_be.c:6569

agpgart_be.c:6550

firegl_public.c:509:

deprecated (declared at include/linux/module.h:578

firegl_public.c:511

deprecated (declared at include/linux/module.h:574

firegl_public.c:531

(declared at include/linux/module.h:573

/firegl_public.c:562:

deprecated (declared at include/linux/module.h:578

/firegl_public.c:2686

_____________________oui -

Link to comment
Share on other sites

Archived

This topic is now archived and is closed to further replies.

×
×
  • Create New...