Jump to content

Problème compilation ndiswrapper sur Ubuntu dapper


Recommended Posts

Je ne parviens par a compiler Ndiswrapper (j'ai pris la dernière version stable de ndis sur source forge)

voici l'erreur (hum ...)

> make[2]: Entering directory `/usr/src/linux-headers-2.6.15-26-sparc64'
>   LD	  /usr/src/ndiswrapper-1.24/driver/built-in.o
>   CC [M]  /usr/src/ndiswrapper-1.24/driver/hal.o
> In file included from /usr/src/ndiswrapper-1.24/driver/ntoskernel.h:47,
>				  from /usr/src/ndiswrapper-1.24/driver/hal.c:24:
> /usr/src/ndiswrapper-1.24/driver/winnt_types.h:234: warning: â__stdcall__â attribute directive ignored
> /usr/src/ndiswrapper-1.24/driver/winnt_types.h:234: warning: âregparmâ attribute directive ignored
> /usr/src/ndiswrapper-1.24/driver/winnt_types.h:525: warning: â__stdcall__â attribute directive ignored
> /usr/src/ndiswrapper-1.24/driver/winnt_types.h:525: warning: âregparmâ attribute directive ignored
> /usr/src/ndiswrapper-1.24/driver/winnt_types.h:541: warning: â__stdcall__â attribute directive ignored
> /usr/src/ndiswrapper-1.24/driver/winnt_types.h:541: warning: âregparmâ attribute directive ignored
> /usr/src/ndiswrapper-1.24/driver/winnt_types.h:548: warning: â__stdcall__â attribute directive ignored
> /usr/src/ndiswrapper-1.24/driver/winnt_types.h:548: warning: âregparmâ attribute directive ignored
> /usr/src/ndiswrapper-1.24/driver/winnt_types.h:642: warning: â__stdcall__â attribute directive ignored
> /usr/src/ndiswrapper-1.24/driver/winnt_types.h:642: warning: âregparmâ attribute directive ignored
> /usr/src/ndiswrapper-1.24/driver/winnt_types.h:643: warning: â__stdcall__â attribute directive ignored
> /usr/src/ndiswrapper-1.24/driver/winnt_types.h:643: warning: âregparmâ attribute directive ignored
> /usr/src/ndiswrapper-1.24/driver/winnt_types.h:956: warning: â__stdcall__â attribute directive ignored
> /usr/src/ndiswrapper-1.24/driver/winnt_types.h:956: warning: âregparmâ attribute directive ignored
> /usr/src/ndiswrapper-1.24/driver/winnt_types.h:1035: warning: â__stdcall__â attribute directive ignored
> /usr/src/ndiswrapper-1.24/driver/winnt_types.h:1035: warning: âregparmâ attribute directive ignored
> /usr/src/ndiswrapper-1.24/driver/winnt_types.h:1203: warning: â__stdcall__â attribute directive ignored
> /usr/src/ndiswrapper-1.24/driver/winnt_types.h:1203: warning: âregparmâ attribute directive ignored
> /usr/src/ndiswrapper-1.24/driver/winnt_types.h:1237: warning: â__stdcall__â attribute directive ignored
> /usr/src/ndiswrapper-1.24/driver/winnt_types.h:1237: warning: âregparmâ attribute directive ignored
> /usr/src/ndiswrapper-1.24/driver/winnt_types.h:1238: warning: â__stdcall__â attribute directive ignored
> /usr/src/ndiswrapper-1.24/driver/winnt_types.h:1238: warning: âregparmâ attribute directive ignored
> /usr/src/ndiswrapper-1.24/driver/winnt_types.h:1297: warning: â__stdcall__â attribute directive ignored
> /usr/src/ndiswrapper-1.24/driver/winnt_types.h:1297: warning: âregparmâ attribute directive ignored
> /usr/src/ndiswrapper-1.24/driver/winnt_types.h:1298: warning: â__stdcall__â attribute directive ignored
> /usr/src/ndiswrapper-1.24/driver/winnt_types.h:1298: warning: âregparmâ attribute directive ignored
> /usr/src/ndiswrapper-1.24/driver/winnt_types.h:1337: warning: â__stdcall__â attribute directive ignored
> /usr/src/ndiswrapper-1.24/driver/winnt_types.h:1337: warning: âregparmâ attribute directive ignored
> /usr/src/ndiswrapper-1.24/driver/winnt_types.h:1437: warning: â__stdcall__â attribute directive ignored
> /usr/src/ndiswrapper-1.24/driver/winnt_types.h:1437: warning: âregparmâ attribute directive ignored
> In file included from /usr/src/ndiswrapper-1.24/driver/ntoskernel.h:67,
>				  from /usr/src/ndiswrapper-1.24/driver/hal.c:24:
> include/asm/dma-mapping.h:50: warning: âenum dma_data_directionâ declared inside parameter list
> include/asm/dma-mapping.h:50: warning: its scope is only this definition or declaration, which is probably not what you want
> include/asm/dma-mapping.h:50: error: parameter 4 (âdirectionâ) has incomplete type
> include/asm/dma-mapping.h:59: warning: âenum dma_data_directionâ declared inside parameter list
> include/asm/dma-mapping.h:59: error: parameter 4 (âdirectionâ) has incomplete type
> include/asm/dma-mapping.h:69: warning: âenum dma_data_directionâ declared inside parameter list
> include/asm/dma-mapping.h:69: error: parameter 5 (âdirectionâ) has incomplete type
> include/asm/dma-mapping.h:78: warning: âenum dma_data_directionâ declared inside parameter list
> include/asm/dma-mapping.h:78: error: parameter 4 (âdirectionâ) has incomplete type
> include/asm/dma-mapping.h:87: warning: âenum dma_data_directionâ declared inside parameter list
> include/asm/dma-mapping.h:87: error: parameter 4 (âdirectionâ) has incomplete type
> include/asm/dma-mapping.h:96: warning: âenum dma_data_directionâ declared inside parameter list
> include/asm/dma-mapping.h:96: error: parameter 4 (âdirectionâ) has incomplete type
> include/asm/dma-mapping.h:105: warning: âenum dma_data_directionâ declared inside parameter list
> include/asm/dma-mapping.h:105: error: parameter 4 (âdirectionâ) has incomplete type
> include/asm/dma-mapping.h:115: warning: âenum dma_data_directionâ declared inside parameter list
> include/asm/dma-mapping.h:115: error: parameter 4 (âdirectionâ) has incomplete type
> include/asm/dma-mapping.h:125: warning: âenum dma_data_directionâ declared inside parameter list
> include/asm/dma-mapping.h:125: error: parameter 4 (âdirectionâ) has incomplete type
> include/asm/dma-mapping.h:134: warning: âenum dma_data_directionâ declared inside parameter list
> include/asm/dma-mapping.h:134: error: parameter 4 (âdirectionâ) has incomplete type
> In file included from /usr/src/ndiswrapper-1.24/driver/hal.c:24:
> /usr/src/ndiswrapper-1.24/driver/ntoskernel.h:429: warning: â__stdcall__â attribute directive ignored
> /usr/src/ndiswrapper-1.24/driver/ntoskernel.h:429: warning: âregparmâ attribute directive ignored
> /usr/src/ndiswrapper-1.24/driver/ntoskernel.h:454: warning: â__stdcall__â attribute directive ignored
> /usr/src/ndiswrapper-1.24/driver/ntoskernel.h:454: warning: âregparmâ attribute directive ignored
> /usr/src/ndiswrapper-1.24/driver/ntoskernel.h:606: warning: âfastcallâ attribute directive ignored
> /usr/src/ndiswrapper-1.24/driver/ntoskernel.h:607: warning: âfastcallâ attribute directive ignored
> /usr/src/ndiswrapper-1.24/driver/ntoskernel.h:610: warning: âfastcallâ attribute directive ignored
> /usr/src/ndiswrapper-1.24/driver/ntoskernel.h:613: warning: âfastcallâ attribute directive ignored
> /usr/src/ndiswrapper-1.24/driver/ntoskernel.h:615: warning: âfastcallâ attribute directive ignored
> /usr/src/ndiswrapper-1.24/driver/ntoskernel.h:616: warning: âfastcallâ attribute directive ignored
> /usr/src/ndiswrapper-1.24/driver/ntoskernel.h:617: warning: âfastcallâ attribute directive ignored
> /usr/src/ndiswrapper-1.24/driver/ntoskernel.h:618: warning: âfastcallâ attribute directive ignored
> /usr/src/ndiswrapper-1.24/driver/ntoskernel.h:619: warning: âfastcallâ attribute directive ignored
> /usr/src/ndiswrapper-1.24/driver/ntoskernel.h:620: warning: âfastcallâ attribute directive ignored
> /usr/src/ndiswrapper-1.24/driver/ntoskernel.h:621: warning: âfastcallâ attribute directive ignored
> /usr/src/ndiswrapper-1.24/driver/ntoskernel.h:622: warning: âfastcallâ attribute directive ignored
> /usr/src/ndiswrapper-1.24/driver/ntoskernel.h:624: warning: âfastcallâ attribute directive ignored
> /usr/src/ndiswrapper-1.24/driver/ntoskernel.h:625: warning: âfastcallâ attribute directive ignored
> /usr/src/ndiswrapper-1.24/driver/ntoskernel.h:631: warning: â__stdcall__â attribute directive ignored
> /usr/src/ndiswrapper-1.24/driver/ntoskernel.h:631: warning: âregparmâ attribute directive ignored
> /usr/src/ndiswrapper-1.24/driver/ntoskernel.h:632: warning: â__stdcall__â attribute directive ignored
> /usr/src/ndiswrapper-1.24/driver/ntoskernel.h:632: warning: âregparmâ attribute directive ignored
> /usr/src/ndiswrapper-1.24/driver/ntoskernel.h:636: warning: â__stdcall__â attribute directive ignored
> /usr/src/ndiswrapper-1.24/driver/ntoskernel.h:636: warning: âregparmâ attribute directive ignored
> /usr/src/ndiswrapper-1.24/driver/ntoskernel.h:642: warning: â__stdcall__â attribute directive ignored
> /usr/src/ndiswrapper-1.24/driver/ntoskernel.h:642: warning: âregparmâ attribute directive ignored
> /usr/src/ndiswrapper-1.24/driver/ntoskernel.h:643: warning: â__stdcall__â attribute directive ignored
> /usr/src/ndiswrapper-1.24/driver/ntoskernel.h:643: warning: âregparmâ attribute directive ignored
> /usr/src/ndiswrapper-1.24/driver/ntoskernel.h:645: warning: â__stdcall__â attribute directive ignored
> /usr/src/ndiswrapper-1.24/driver/ntoskernel.h:645: warning: âregparmâ attribute directive ignored
> /usr/src/ndiswrapper-1.24/driver/ntoskernel.h:646: warning: â__stdcall__â attribute directive ignored
> /usr/src/ndiswrapper-1.24/driver/ntoskernel.h:646: warning: âregparmâ attribute directive ignored
> /usr/src/ndiswrapper-1.24/driver/ntoskernel.h:648: warning: â__stdcall__â attribute directive ignored
> /usr/src/ndiswrapper-1.24/driver/ntoskernel.h:648: warning: âregparmâ attribute directive ignored
> /usr/src/ndiswrapper-1.24/driver/ntoskernel.h:649: warning: â__stdcall__â attribute directive ignored
> /usr/src/ndiswrapper-1.24/driver/ntoskernel.h:649: warning: âregparmâ attribute directive ignored
> /usr/src/ndiswrapper-1.24/driver/ntoskernel.h:651: warning: â__stdcall__â attribute directive ignored
> /usr/src/ndiswrapper-1.24/driver/ntoskernel.h:651: warning: âregparmâ attribute directive ignored
> /usr/src/ndiswrapper-1.24/driver/ntoskernel.h:653: warning: â__stdcall__â attribute directive ignored
> /usr/src/ndiswrapper-1.24/driver/ntoskernel.h:653: warning: âregparmâ attribute directive ignored
> /usr/src/ndiswrapper-1.24/driver/ntoskernel.h:654: warning: â__stdcall__â attribute directive ignored
> /usr/src/ndiswrapper-1.24/driver/ntoskernel.h:654: warning: âregparmâ attribute directive ignored
> /usr/src/ndiswrapper-1.24/driver/ntoskernel.h:655: warning: â__stdcall__â attribute directive ignored
> /usr/src/ndiswrapper-1.24/driver/ntoskernel.h:655: warning: âregparmâ attribute directive ignored
> /usr/src/ndiswrapper-1.24/driver/ntoskernel.h:656: warning: â__stdcall__â attribute directive ignored
> /usr/src/ndiswrapper-1.24/driver/ntoskernel.h:656: warning: âregparmâ attribute directive ignored
> /usr/src/ndiswrapper-1.24/driver/ntoskernel.h:657: warning: â__stdcall__â attribute directive ignored
> /usr/src/ndiswrapper-1.24/driver/ntoskernel.h:657: warning: âregparmâ attribute directive ignored
> /usr/src/ndiswrapper-1.24/driver/ntoskernel.h:658: warning: â__stdcall__â attribute directive ignored
> /usr/src/ndiswrapper-1.24/driver/ntoskernel.h:658: warning: âregparmâ attribute directive ignored
> /usr/src/ndiswrapper-1.24/driver/ntoskernel.h:659: warning: â__stdcall__â attribute directive ignored
> /usr/src/ndiswrapper-1.24/driver/ntoskernel.h:659: warning: âregparmâ attribute directive ignored
> /usr/src/ndiswrapper-1.24/driver/ntoskernel.h:662: warning: â__stdcall__â attribute directive ignored
> /usr/src/ndiswrapper-1.24/driver/ntoskernel.h:662: warning: âregparmâ attribute directive ignored
> /usr/src/ndiswrapper-1.24/driver/ntoskernel.h:664: warning: â__stdcall__â attribute directive ignored
> /usr/src/ndiswrapper-1.24/driver/ntoskernel.h:664: warning: âregparmâ attribute directive ignored
> /usr/src/ndiswrapper-1.24/driver/ntoskernel.h:665: warning: â__stdcall__â attribute directive ignored
> /usr/src/ndiswrapper-1.24/driver/ntoskernel.h:665: warning: âregparmâ attribute directive ignored
> /usr/src/ndiswrapper-1.24/driver/ntoskernel.h:666: warning: â__stdcall__â attribute directive ignored
> /usr/src/ndiswrapper-1.24/driver/ntoskernel.h:666: warning: âregparmâ attribute directive ignored
> /usr/src/ndiswrapper-1.24/driver/ntoskernel.h:670: warning: â__stdcall__â attribute directive ignored
> /usr/src/ndiswrapper-1.24/driver/ntoskernel.h:670: warning: âregparmâ attribute directive ignored
> /usr/src/ndiswrapper-1.24/driver/ntoskernel.h:672: warning: â__stdcall__â attribute directive ignored
> /usr/src/ndiswrapper-1.24/driver/ntoskernel.h:672: warning: âregparmâ attribute directive ignored
> /usr/src/ndiswrapper-1.24/driver/ntoskernel.h:673: warning: â__stdcall__â attribute directive ignored
> /usr/src/ndiswrapper-1.24/driver/ntoskernel.h:673: warning: âregparmâ attribute directive ignored
> /usr/src/ndiswrapper-1.24/driver/ntoskernel.h:674: warning: â__stdcall__â attribute directive ignored
> /usr/src/ndiswrapper-1.24/driver/ntoskernel.h:674: warning: âregparmâ attribute directive ignored
> /usr/src/ndiswrapper-1.24/driver/ntoskernel.h:675: warning: â__stdcall__â attribute directive ignored
> /usr/src/ndiswrapper-1.24/driver/ntoskernel.h:675: warning: âregparmâ attribute directive ignored
> /usr/src/ndiswrapper-1.24/driver/ntoskernel.h:677: warning: â__stdcall__â attribute directive ignored
> /usr/src/ndiswrapper-1.24/driver/ntoskernel.h:677: warning: âregparmâ attribute directive ignored
> /usr/src/ndiswrapper-1.24/driver/ntoskernel.h:680: warning: â__stdcall__â attribute directive ignored
> /usr/src/ndiswrapper-1.24/driver/ntoskernel.h:680: warning: âregparmâ attribute directive ignored
> /usr/src/ndiswrapper-1.24/driver/ntoskernel.h:682: warning: â__stdcall__â attribute directive ignored
> /usr/src/ndiswrapper-1.24/driver/ntoskernel.h:682: warning: âregparmâ attribute directive ignored
> /usr/src/ndiswrapper-1.24/driver/ntoskernel.h:684: warning: â__stdcall__â attribute directive ignored
> /usr/src/ndiswrapper-1.24/driver/ntoskernel.h:684: warning: âregparmâ attribute directive ignored
> /usr/src/ndiswrapper-1.24/driver/ntoskernel.h:686: warning: â__stdcall__â attribute directive ignored
> /usr/src/ndiswrapper-1.24/driver/ntoskernel.h:686: warning: âregparmâ attribute directive ignored
> /usr/src/ndiswrapper-1.24/driver/ntoskernel.h:687: warning: â__stdcall__â attribute directive ignored
> /usr/src/ndiswrapper-1.24/driver/ntoskernel.h:687: warning: âregparmâ attribute directive ignored
> /usr/src/ndiswrapper-1.24/driver/ntoskernel.h:688: warning: â__stdcall__â attribute directive ignored
> /usr/src/ndiswrapper-1.24/driver/ntoskernel.h:688: warning: âregparmâ attribute directive ignored
> /usr/src/ndiswrapper-1.24/driver/ntoskernel.h:689: warning: â__stdcall__â attribute directive ignored
> /usr/src/ndiswrapper-1.24/driver/ntoskernel.h:689: warning: âregparmâ attribute directive ignored
> /usr/src/ndiswrapper-1.24/driver/ntoskernel.h:693: warning: â__stdcall__â attribute directive ignored
> /usr/src/ndiswrapper-1.24/driver/ntoskernel.h:693: warning: âregparmâ attribute directive ignored
> /usr/src/ndiswrapper-1.24/driver/ntoskernel.h:697: warning: â__stdcall__â attribute directive ignored
> /usr/src/ndiswrapper-1.24/driver/ntoskernel.h:697: warning: âregparmâ attribute directive ignored
> /usr/src/ndiswrapper-1.24/driver/ntoskernel.h:698: warning: â__stdcall__â attribute directive ignored
> /usr/src/ndiswrapper-1.24/driver/ntoskernel.h:698: warning: âregparmâ attribute directive ignored
> /usr/src/ndiswrapper-1.24/driver/ntoskernel.h:700: warning: â__stdcall__â attribute directive ignored
> /usr/src/ndiswrapper-1.24/driver/ntoskernel.h:700: warning: âregparmâ attribute directive ignored
> /usr/src/ndiswrapper-1.24/driver/ntoskernel.h:703: warning: â__stdcall__â attribute directive ignored
> /usr/src/ndiswrapper-1.24/driver/ntoskernel.h:703: warning: âregparmâ attribute directive ignored
> /usr/src/ndiswrapper-1.24/driver/ntoskernel.h:705: warning: â__stdcall__â attribute directive ignored
> /usr/src/ndiswrapper-1.24/driver/ntoskernel.h:705: warning: âregparmâ attribute directive ignored
> /usr/src/ndiswrapper-1.24/driver/ntoskernel.h:707: warning: â__stdcall__â attribute directive ignored
> /usr/src/ndiswrapper-1.24/driver/ntoskernel.h:707: warning: âregparmâ attribute directive ignored
> /usr/src/ndiswrapper-1.24/driver/ntoskernel.h:709: warning: â__stdcall__â attribute directive ignored
> /usr/src/ndiswrapper-1.24/driver/ntoskernel.h:709: warning: âregparmâ attribute directive ignored
> /usr/src/ndiswrapper-1.24/driver/ntoskernel.h:710: warning: â__stdcall__â attribute directive ignored
> /usr/src/ndiswrapper-1.24/driver/ntoskernel.h:710: warning: âregparmâ attribute directive ignored
> /usr/src/ndiswrapper-1.24/driver/ntoskernel.h:711: warning: â__stdcall__â attribute directive ignored
> /usr/src/ndiswrapper-1.24/driver/ntoskernel.h:711: warning: âregparmâ attribute directive ignored
> /usr/src/ndiswrapper-1.24/driver/ntoskernel.h:712: warning: â__stdcall__â attribute directive ignored
> /usr/src/ndiswrapper-1.24/driver/ntoskernel.h:712: warning: âregparmâ attribute directive ignored
> /usr/src/ndiswrapper-1.24/driver/ntoskernel.h:713: warning: â__stdcall__â attribute directive ignored
> /usr/src/ndiswrapper-1.24/driver/ntoskernel.h:713: warning: âregparmâ attribute directive ignored
> /usr/src/ndiswrapper-1.24/driver/ntoskernel.h:715: warning: â__stdcall__â attribute directive ignored
> /usr/src/ndiswrapper-1.24/driver/ntoskernel.h:715: warning: âregparmâ attribute directive ignored
> /usr/src/ndiswrapper-1.24/driver/ntoskernel.h:716: warning: â__stdcall__â attribute directive ignored
> /usr/src/ndiswrapper-1.24/driver/ntoskernel.h:716: warning: âregparmâ attribute directive ignored
> /usr/src/ndiswrapper-1.24/driver/ntoskernel.h:718: warning: â__stdcall__â attribute directive ignored
> /usr/src/ndiswrapper-1.24/driver/ntoskernel.h:718: warning: âregparmâ attribute directive ignored
> /usr/src/ndiswrapper-1.24/driver/ntoskernel.h:721: warning: â__stdcall__â attribute directive ignored
> /usr/src/ndiswrapper-1.24/driver/ntoskernel.h:721: warning: âregparmâ attribute directive ignored
> /usr/src/ndiswrapper-1.24/driver/ntoskernel.h:724: warning: â__stdcall__â attribute directive ignored
> /usr/src/ndiswrapper-1.24/driver/ntoskernel.h:724: warning: âregparmâ attribute directive ignored
> /usr/src/ndiswrapper-1.24/driver/ntoskernel.h:725: warning: â__stdcall__â attribute directive ignored
> /usr/src/ndiswrapper-1.24/driver/ntoskernel.h:725: warning: âregparmâ attribute directive ignored
> /usr/src/ndiswrapper-1.24/driver/ntoskernel.h:726: warning: â__stdcall__â attribute directive ignored
> /usr/src/ndiswrapper-1.24/driver/ntoskernel.h:726: warning: âregparmâ attribute directive ignored
> /usr/src/ndiswrapper-1.24/driver/ntoskernel.h:728: warning: â__stdcall__â attribute directive ignored
> /usr/src/ndiswrapper-1.24/driver/ntoskernel.h:728: warning: âregparmâ attribute directive ignored
> /usr/src/ndiswrapper-1.24/driver/ntoskernel.h:729: warning: â__stdcall__â attribute directive ignored
> /usr/src/ndiswrapper-1.24/driver/ntoskernel.h:729: warning: âregparmâ attribute directive ignored
> /usr/src/ndiswrapper-1.24/driver/ntoskernel.h:730: warning: â__stdcall__â attribute directive ignored
> /usr/src/ndiswrapper-1.24/driver/ntoskernel.h:730: warning: âregparmâ attribute directive ignored
> /usr/src/ndiswrapper-1.24/driver/ntoskernel.h:733: warning: â__stdcall__â attribute directive ignored
> /usr/src/ndiswrapper-1.24/driver/ntoskernel.h:733: warning: âregparmâ attribute directive ignored
> /usr/src/ndiswrapper-1.24/driver/ntoskernel.h:735: warning: â__stdcall__â attribute directive ignored
> /usr/src/ndiswrapper-1.24/driver/ntoskernel.h:735: warning: âregparmâ attribute directive ignored
> /usr/src/ndiswrapper-1.24/driver/ntoskernel.h:736: warning: â__stdcall__â attribute directive ignored
> /usr/src/ndiswrapper-1.24/driver/ntoskernel.h:736: warning: âregparmâ attribute directive ignored
> /usr/src/ndiswrapper-1.24/driver/ntoskernel.h:738: warning: â__stdcall__â attribute directive ignored
> /usr/src/ndiswrapper-1.24/driver/ntoskernel.h:738: warning: âregparmâ attribute directive ignored
> /usr/src/ndiswrapper-1.24/driver/ntoskernel.h:740: warning: â__stdcall__â attribute directive ignored
> /usr/src/ndiswrapper-1.24/driver/ntoskernel.h:740: warning: âregparmâ attribute directive ignored
> /usr/src/ndiswrapper-1.24/driver/ntoskernel.h:742: warning: â__stdcall__â attribute directive ignored
> /usr/src/ndiswrapper-1.24/driver/ntoskernel.h:742: warning: âregparmâ attribute directive ignored
> /usr/src/ndiswrapper-1.24/driver/ntoskernel.h:743: warning: â__stdcall__â attribute directive ignored
> /usr/src/ndiswrapper-1.24/driver/ntoskernel.h:743: warning: âregparmâ attribute directive ignored
> /usr/src/ndiswrapper-1.24/driver/ntoskernel.h:744: warning: â__stdcall__â attribute directive ignored
> /usr/src/ndiswrapper-1.24/driver/ntoskernel.h:744: warning: âregparmâ attribute directive ignored
> /usr/src/ndiswrapper-1.24/driver/ntoskernel.h:745: warning: â__stdcall__â attribute directive ignored
> /usr/src/ndiswrapper-1.24/driver/ntoskernel.h:745: warning: âregparmâ attribute directive ignored
> /usr/src/ndiswrapper-1.24/driver/ntoskernel.h:748: warning: â__stdcall__â attribute directive ignored
> /usr/src/ndiswrapper-1.24/driver/ntoskernel.h:748: warning: âregparmâ attribute directive ignored
> /usr/src/ndiswrapper-1.24/driver/hal.c:28: warning: â__stdcall__â attribute directive ignored
> /usr/src/ndiswrapper-1.24/driver/hal.c:28: warning: âregparmâ attribute directive ignored
> /usr/src/ndiswrapper-1.24/driver/hal.c:34: warning: â__stdcall__â attribute directive ignored
> /usr/src/ndiswrapper-1.24/driver/hal.c:34: warning: âregparmâ attribute directive ignored
> /usr/src/ndiswrapper-1.24/driver/hal.c:40: warning: â__stdcall__â attribute directive ignored
> /usr/src/ndiswrapper-1.24/driver/hal.c:40: warning: âregparmâ attribute directive ignored
> /usr/src/ndiswrapper-1.24/driver/hal.c:46: warning: â__stdcall__â attribute directive ignored
> /usr/src/ndiswrapper-1.24/driver/hal.c:46: warning: âregparmâ attribute directive ignored
> /usr/src/ndiswrapper-1.24/driver/hal.c:52: warning: â__stdcall__â attribute directive ignored
> /usr/src/ndiswrapper-1.24/driver/hal.c:52: warning: âregparmâ attribute directive ignored
> /usr/src/ndiswrapper-1.24/driver/hal.c:58: warning: â__stdcall__â attribute directive ignored
> /usr/src/ndiswrapper-1.24/driver/hal.c:58: warning: âregparmâ attribute directive ignored
> /usr/src/ndiswrapper-1.24/driver/hal.c:64: warning: â__stdcall__â attribute directive ignored
> /usr/src/ndiswrapper-1.24/driver/hal.c:64: warning: âregparmâ attribute directive ignored
> /usr/src/ndiswrapper-1.24/driver/hal.c:70: warning: â__stdcall__â attribute directive ignored
> /usr/src/ndiswrapper-1.24/driver/hal.c:70: warning: âregparmâ attribute directive ignored
> /usr/src/ndiswrapper-1.24/driver/hal.c:76: warning: â__stdcall__â attribute directive ignored
> /usr/src/ndiswrapper-1.24/driver/hal.c:76: warning: âregparmâ attribute directive ignored
> /usr/src/ndiswrapper-1.24/driver/hal.c:82: warning: â__stdcall__â attribute directive ignored
> /usr/src/ndiswrapper-1.24/driver/hal.c:82: warning: âregparmâ attribute directive ignored
> /usr/src/ndiswrapper-1.24/driver/hal.c:88: warning: â__stdcall__â attribute directive ignored
> /usr/src/ndiswrapper-1.24/driver/hal.c:88: warning: âregparmâ attribute directive ignored
> /usr/src/ndiswrapper-1.24/driver/hal.c:94: warning: â__stdcall__â attribute directive ignored
> /usr/src/ndiswrapper-1.24/driver/hal.c:94: warning: âregparmâ attribute directive ignored
> /usr/src/ndiswrapper-1.24/driver/hal.c:100: warning: â__stdcall__â attribute directive ignored
> /usr/src/ndiswrapper-1.24/driver/hal.c:100: warning: âregparmâ attribute directive ignored
> /usr/src/ndiswrapper-1.24/driver/hal.c:106: warning: â__stdcall__â attribute directive ignored
> /usr/src/ndiswrapper-1.24/driver/hal.c:106: warning: âregparmâ attribute directive ignored
> /usr/src/ndiswrapper-1.24/driver/hal.c:112: warning: â__stdcall__â attribute directive ignored
> /usr/src/ndiswrapper-1.24/driver/hal.c:112: warning: âregparmâ attribute directive ignored
> /usr/src/ndiswrapper-1.24/driver/hal.c:118: warning: â__stdcall__â attribute directive ignored
> /usr/src/ndiswrapper-1.24/driver/hal.c:118: warning: âregparmâ attribute directive ignored
> /usr/src/ndiswrapper-1.24/driver/hal.c:124: warning: âfastcallâ attribute directive ignored
> /usr/src/ndiswrapper-1.24/driver/hal.c:130: warning: âfastcallâ attribute directive ignored
> /usr/src/ndiswrapper-1.24/driver/hal.c:136: warning: âfastcallâ attribute directive ignored
> /usr/src/ndiswrapper-1.24/driver/hal.c:142: warning: âfastcallâ attribute directive ignored
> /usr/src/ndiswrapper-1.24/driver/hal.c:148: warning: âfastcallâ attribute directive ignored
> /usr/src/ndiswrapper-1.24/driver/hal.c:158: warning: âfastcallâ attribute directive ignored
> make[3]: *** [/usr/src/ndiswrapper-1.24/driver/hal.o] Error 1
> make[2]: *** [_module_/usr/src/ndiswrapper-1.24/driver] Error 2
> make[2]: Leaving directory `/usr/src/linux-headers-2.6.15-26-sparc64'
> make[1]: *** [default] Error 2
> make[1]: Leaving directory `/usr/src/ndiswrapper-1.24/driver'
-bash: command substitution: line 1: unexpected EOF while looking for matching `''
-bash: command substitution: line 4: syntax error: unexpected end of file
-bash: bad substitution: no closing "`" in `/usr/src/ndiswrapper-1.24/driver'
root@ftpdupingouin:/usr/src/ndiswrapper-1.24# make: *** [all] Error 2
-bash: make:: command not found
root@ftpdupingouin:/usr/src/ndiswrapper-1.24# root@ftpdupingouin:/usr/src/ndiswrapper-1.24#
-bash: root@ftpdupingouin:/usr/src/ndiswrapper-1.24#: No such file or directory
root@ftpdupingouin:/usr/src/ndiswrapper-1.24#

Mon noyau:

Linux ftpdupingouin 2.6.15-26-sparc64 #1 Fri Sep 8 19:56:21 UTC 2006 sparc64 GNU/Linux

Merci a tous

Pas moyen de m'en sortir :-( Pourquoi c'est pas en .Deb Ndis???

Link to comment
Share on other sites

Oulah, doucement tyrann27.

Faut respirer avant de poster, hein :p

Merci, je ne suis pas un noob, je l'ai déja fait sur d'autre machine.

Mais là je n'y arrive pas. Je tiens a préciser qu'il s'agit d'une ubuntu sur une architecture Sparc... Si ça peut aider...

Merci

Mike

Link to comment
Share on other sites

Oulah, doucement tyrann27.

Faut respirer avant de poster, hein :arrow:

Wokatépé :arrow:

Bon alors faut qu'on m'explique pourquoi c'est pas suffisant en utilisant le gestionnaire de paquet!

Sorry lambda, j'avoue que je suis un peu agressif pour le moment...

Allez spa grave on fait la paix :craint:

Link to comment
Share on other sites

Ah ben forcément si c'est pour une sparc ça change tout.

Tous les packets ne sont pas disponibles pour toutes les versions ni dans toutes les branches et pour toute les architectures.

http://packages.ubuntu.com/cgi-bin/search_...amp;release=all

Verifie ce que tu veux installer.

Merci

Simple question...

Comment puis-je vérifier si le module RT61 pour une carte wifi PC54G3 est présent??? Vaut-il mieux dans ce càs là mettre une sarge ou une debian? C'est pour faire un serveur FTP.

Hors Proftpd que je veux utiliser n'est pas disponible par défaut dans les sources ubuntu Sparc :-x

Link to comment
Share on other sites

Salut

Je me pose juste une question comme ça : ça marche ndiswrapper sur sparc ?

Car ça voudrait dire que l'on voudrais faire tourner des drivers windows sous linux, chose un peu tordu quand meme, et en plus des drivers x86 sur sparc ?

A premiere vu c'est pas ce qu'il y a de plus evident dans la possibilité de le faire .

a+

Link to comment
Share on other sites

mais je veux rien dire mais le module est compilé en théorie... il suffit d'installer ndiswrapper-utils.

Fait un apt-cache search ndiswrapper et tu auras la réponse à ta question.

Sur une archi 32 bits, ça amrche bien. Je n'ai pas essayé en 64 bits car mon drivers wifi n'existe pas :D et comme madwifi ne supporte pas mon chipset atheros re :D

Link to comment
Share on other sites

Archived

This topic is now archived and is closed to further replies.

×
×
  • Create New...